BDBM50227163 2-(4-((3-(3-benzoyl-8-(trifluoromethyl)quinolin-5-yl)phenoxy)methyl)phenyl)hex-4-ynoic acid::CHEMBL254539
SMILES CC#CCC(C(O)=O)c1ccc(COc2cccc(c2)-c2ccc(c3ncc(cc23)C(=O)c2ccccc2)C(F)(F)F)cc1
InChI Key InChIKey=SBYNVOVSJLOHRE-UHFFFAOYSA-N
Data  2 IC50
  Tab Delimited (TSV)   2D SDfile   Computed 3D by Vconf -m prep SDfile
Find this compound or compounds like it in BindingDB:
Activity Spreadsheet -- Enzyme Inhibition Constant Data from BindingDB
Found 2 hits for monomerid = 50227163
TargetOxysterols receptor LXR-alpha(Homo sapiens (Human))
Wyeth Pharmaceuticals
Curated by ChEMBL
LigandPNGBDBM50227163(2-(4-((3-(3-benzoyl-8-(trifluoromethyl)quinolin-5-...)
Affinity DataIC50:  6nM. Assay description: Binding affinity at human LXRalpha
In DepthDetails ArticlePubMed
TargetOxysterols receptor LXR-beta(Homo sapiens (Human))
Wyeth Pharmaceuticals
Curated by ChEMBL
LigandPNGBDBM50227163(2-(4-((3-(3-benzoyl-8-(trifluoromethyl)quinolin-5-...)
Affinity DataIC50:  2nM. Assay description: Binding affinity at human LXRbeta
In DepthDetails ArticlePubMed