BDBM50227237 CHEMBL305109
SMILES CCOC(=O)N1CCCC(OC)(C1=O)c1ccccc1
InChI Key InChIKey=SYCBZOVZEXSPEZ-UHFFFAOYSA-N
Data  1 IC50
  Tab Delimited (TSV)   2D SDfile   Computed 3D by Vconf -m prep SDfile
Find this compound or compounds like it in BindingDB:
Activity Spreadsheet -- Enzyme Inhibition Constant Data from BindingDB
Found 1 hit for monomerid = 50227237
TargetSodium channel protein type 1/2/3 subunit alpha(Rattus norvegicus)
University Of Alabama
Curated by ChEMBL
LigandPNGBDBM50227237(CHEMBL305109)
Affinity DataIC50:  5.90E+5nM. Assay description: In vitro inhibition of [3H]-BTX-B binding to sodium channels in rat brain synapto-neurosomes
In DepthDetails ArticlePubMed