BDBM50227298 CHEMBL147255
SMILES CCOC(C)(COC1CCN(CC1)c1nc(N)c2cc(OC)c(OC)cc2n1)c1ccccc1
InChI Key InChIKey=IVTQCKMRNFHXKP-UHFFFAOYSA-N
Data  1 KI
  Tab Delimited (TSV)   2D SDfile   Computed 3D by Vconf -m prep SDfile
Find this compound or compounds like it in BindingDB:
Activity Spreadsheet -- Enzyme Inhibition Constant Data from BindingDB
Found 1 hit for monomerid = 50227298
TargetAlpha-1A/Alpha-1B/Alpha-1D adrenergic receptor(Rattus norvegicus (rat))
Pfizer
Curated by ChEMBL
LigandPNGBDBM50227298(CHEMBL147255)
Affinity DataKi:  0.150nM. Assay description: Binding affinity for alpha-1 adrenergic receptor by displacement of [3H]-prazosin from rat brain homogenate preparation
In DepthDetails ArticlePubMed