BDBM50227373 CHEMBL266119
SMILES COc1cc2nc(cc(N)c2cc1OC)N1CCN(CC1)C(=O)c1ccccc1
InChI Key InChIKey=OSYWJTLQNPVIKQ-UHFFFAOYSA-N
Data  1 KI
  Tab Delimited (TSV)   2D SDfile   Computed 3D by Vconf -m prep SDfile
Find this compound or compounds like it in BindingDB:
Activity Spreadsheet -- Enzyme Inhibition Constant Data from BindingDB
Found 1 hit for monomerid = 50227373
TargetAlpha-1A/Alpha-1B/Alpha-1D adrenergic receptor(Rattus norvegicus (rat))
Pfizer
Curated by ChEMBL
LigandPNGBDBM50227373(CHEMBL266119)
Affinity DataKi:  0.490nM. Assay description: Binding affinity towards alpha-1 adrenergic receptor from rat brain homogenate preparation by displacement of [3H]prazosin
In DepthDetails ArticlePubMed