BDBM50227607 CHEMBL44450
SMILES Nc1cccc(OCCCN2CCN(CC2)c2ccccc2)c1
InChI Key InChIKey=XXUFGPBRVNJCJM-UHFFFAOYSA-N
Data  2 IC50
  Tab Delimited (TSV)   2D SDfile   Computed 3D by Vconf -m prep SDfile
Find this compound or compounds like it in BindingDB:
Activity Spreadsheet -- Enzyme Inhibition Constant Data from BindingDB
Found 2 hits for monomerid = 50227607
TargetD(1A)/D(1B)/D(2)/D(3)/D(4) dopamine receptor(Rattus norvegicus (rat))
Warner-Lambert
Curated by ChEMBL
LigandPNGBDBM50227607(CHEMBL44450)
Affinity DataIC50:  138nM. Assay description: Compound was tested for inhibitory binding activity against Dopamine receptor in rat striatal membranes using [3H]HAL as the radioligand.
In DepthDetails ArticlePubMed
TargetD(1A)/D(1B)/D(2)/D(3)/D(4) dopamine receptor(Rattus norvegicus (rat))
Warner-Lambert
Curated by ChEMBL
LigandPNGBDBM50227607(CHEMBL44450)
Affinity DataIC50:  138nM. Assay description: In vitro inhibition of [3H]haloperidol (HPD) binding to dopamine (DA) receptor of rat striatal membranes
In DepthDetails ArticlePubMed