BDBM50227646 CHEMBL51563
SMILES [Br-].CCCCCCCCCCCCCCCCOCCC[n+]1ccccc1
InChI Key InChIKey=JFTFAXKBFRAUBD-UHFFFAOYSA-N
Data  1 IC50
  Tab Delimited (TSV)   2D SDfile   Computed 3D by Vconf -m prep SDfile
Find this compound or compounds like it in BindingDB:
Activity Spreadsheet -- Enzyme Inhibition Constant Data from BindingDB
Found 1 hit for monomerid = 50227646
TargetO94806/P05129/P05771/P17252/P24723/P41743/Q02156/Q04759/Q05513/Q05655/Q15139(Homo sapiens (Human))
University Of North Carolina
Curated by ChEMBL
LigandPNGBDBM50227646(CHEMBL51563)
Affinity DataIC50: >4.00E+4nM. Assay description: Inhibition of Protein Kinase C (PKC) isolated from HL-60 human promyelocytic leukemia cells
In DepthDetails ArticlePubMed