BDBM50227803 CHEMBL40920
SMILES [H][C@]1(O[C@H]1CC1CO[C@@H](C\C(C)=C\C(=O)CCCCCCCCCC(SC)(SC)SC)[C@H](O)[C@@H]1O)[C@@H](C)[C@H](C)O
InChI Key InChIKey=IIDAUMFWDDMNJW-DFBHFNKVSA-N
Data  1 IC50
  Tab Delimited (TSV)   2D SDfile   Computed 3D by Vconf -m prep SDfile
Find this compound or compounds like it in BindingDB:
Activity Spreadsheet -- Enzyme Inhibition Constant Data from BindingDB
Found 1 hit for monomerid = 50227803
TargetIsoleucine--tRNA ligase(Escherichia coli)
Abbott Laboratories
Curated by ChEMBL
LigandPNGBDBM50227803(CHEMBL40920)
Affinity DataIC50:  1.48E+4nM. Assay description: Inhibitory activity against Isoleucyl-tRNA synthetase
In DepthDetails ArticlePubMed