BDBM50227837 CHEMBL52131
SMILES CN(C)CC(O)COc1ccccc1CCc1ccccc1
InChI Key InChIKey=QXHABUAVMNCRKP-UHFFFAOYSA-N
Data  1 KI  1 IC50
  Tab Delimited (TSV)   2D SDfile   Computed 3D by Vconf -m prep SDfile
Find this compound or compounds like it in BindingDB:
Activity Spreadsheet -- Enzyme Inhibition Constant Data from BindingDB
Found 2 hits for monomerid = 50227837
TargetSerotonin 2 (5-HT2) receptor(RAT)
Mitsubishi Kasei
Curated by ChEMBL
LigandPNGBDBM50227837(CHEMBL52131)
Affinity DataKi:  14nM. Assay description: Inhibition of 5-hydroxytryptamine 2 induced vasoconstriction of rat caudal artery.
In DepthDetails ArticlePubMed
TargetSerotonin 2 (5-HT2) receptor(RAT)
Mitsubishi Kasei
Curated by ChEMBL
LigandPNGBDBM50227837(CHEMBL52131)
Affinity DataIC50:  55nM. Assay description: Antagonistic activity against 5-hydroxytryptamine 2 receptor on rat frontal cortex membrane.
In DepthDetails ArticlePubMed