BDBM50227846 (3S,4S)-1-tert-butyl-N-hydroxy-3-(4-((2-methylquinolin-4-yl)methoxy)benzamido)piperidine-4-carboxamide::CHEMBL252891
SMILES Cc1cc(COc2ccc(cc2)C(=O)N[C@@H]2CN(CC[C@@H]2C(=O)NO)C(C)(C)C)c2ccccc2n1
InChI Key InChIKey=VMOZPKFTEJFSFL-UKILVPOCSA-N
Data  1 IC50
  Tab Delimited (TSV)   2D SDfile   Computed 3D by Vconf -m prep SDfile
Find this compound or compounds like it in BindingDB:
Activity Spreadsheet -- Enzyme Inhibition Constant Data from BindingDB
Found 1 hit for monomerid = 50227846
TargetDisintegrin and metalloproteinase domain-containing protein 17(Sus scrofa (pig))
Bristol-Myers Squibb
Curated by ChEMBL
LigandPNGBDBM50227846((3S,4S)-1-tert-butyl-N-hydroxy-3-(4-((2-methylquin...)
Affinity DataIC50:  2nM. Assay description: Inhibition of pig TACE
In DepthDetails ArticlePubMed