BDBM50227851 CHEMBL266223
SMILES COC(=O)\C=C\C(=O)Nc1ccc(CCCCC(=O)N2CCN(CC2)c2nc(N)c3cc(OC)c(OC)cc3n2)cc1
InChI Key InChIKey=RZYZZMZIPSVZRD-OUKQBFOZSA-N
Data  1 IC50
  Tab Delimited (TSV)   2D SDfile   Computed 3D by Vconf -m prep SDfile
Find this compound or compounds like it in BindingDB:
Activity Spreadsheet -- Enzyme Inhibition Constant Data from BindingDB
Found 1 hit for monomerid = 50227851
TargetAlpha-1A/Alpha-1B/Alpha-1D adrenergic receptor(Rattus norvegicus (rat))
National Institute On Aging/Grc
Curated by ChEMBL
LigandPNGBDBM50227851(CHEMBL266223)
Affinity DataIC50:  4.5nM. Assay description: Displacement of [3H]prazosin binding to Alpha-1 adrenergic receptor sites on rat cerebral cortical membranes at 100 nM concentration
In DepthDetails ArticlePubMed