BDBM50227902 CHEMBL76706
SMILES Cc1ccc(NC(=O)N(Cc2ccccc2)Cc2ccccc2)c(C)c1
InChI Key InChIKey=XZZPSMCICXEUHZ-UHFFFAOYSA-N
Data  2 IC50
  Tab Delimited (TSV)   2D SDfile   Computed 3D by Vconf -m prep SDfile
Find this compound or compounds like it in BindingDB:
Activity Spreadsheet -- Enzyme Inhibition Constant Data from BindingDB
Found 2 hits for monomerid = 50227902
TargetSterol O-acyltransferase 1(Rattus norvegicus)
American Cyanamid
Curated by ChEMBL
LigandPNGBDBM50227902(CHEMBL76706)
Affinity DataIC50:  1.71E+3nM. Assay description: In vitro inhibitory concentration against Acyl coenzyme A:cholesterol acyltransferase derived from smooth muscle cells from thoracic aorta of monkeys
In DepthDetails ArticlePubMed
TargetSterol O-acyltransferase 1(Homo sapiens (Human))
American Cyanamid
Curated by ChEMBL
LigandPNGBDBM50227902(CHEMBL76706)
Affinity DataIC50:  3.77E+3nM. Assay description: In vitro inhibitory concentration against Acyl coenzyme A:cholesterol acyltransferase derived from smooth muscle cells from thoracic aorta of monkeys
In DepthDetails ArticlePubMed