BDBM50228095 2-(4-fluorophenoxy)-1-morpholinoethanone::CHEMBL235039
SMILES Fc1ccc(OCC(=O)N2CCOCC2)cc1
InChI Key InChIKey=SRTMEEYXGALOCT-UHFFFAOYSA-N
Data  1 Kd
  Tab Delimited (TSV)   2D SDfile   Computed 3D by Vconf -m prep SDfile
Find this compound or compounds like it in BindingDB:
Activity Spreadsheet -- Enzyme Inhibition Constant Data from BindingDB
Found 1 hit for monomerid = 50228095
TargetPeptidyl-prolyl cis-trans isomerase FKBP1A(Homo sapiens (Human))
University Of California San Diego
Curated by ChEMBL
LigandPNGBDBM50228095(2-(4-fluorophenoxy)-1-morpholinoethanone | CHEMBL2...)
Affinity DataKd:  5.76E+5nM. Assay description: Binding affinity to human FKBP12 expressed in Escherichia coli BL21(DE3) by isothermal titration calorimetry
In DepthDetails ArticlePubMed