BDBM50228127 1-morpholino-2-(phenylthio)ethanone::CHEMBL236971
SMILES O=C(CSc1ccccc1)N1CCOCC1
InChI Key InChIKey=NAMFKTBQSCMITK-UHFFFAOYSA-N
Data  1 Kd
  Tab Delimited (TSV)   2D SDfile   Computed 3D by Vconf -m prep SDfile
Find this compound or compounds like it in BindingDB:
Activity Spreadsheet -- Enzyme Inhibition Constant Data from BindingDB
Found 1 hit for monomerid = 50228127
TargetPeptidyl-prolyl cis-trans isomerase FKBP1A(Homo sapiens (Human))
University Of California San Diego
Curated by ChEMBL
LigandPNGBDBM50228127(1-morpholino-2-(phenylthio)ethanone | CHEMBL236971)
Affinity DataKd:  1.53E+4nM. Assay description: Binding affinity to human FKBP12 expressed in Escherichia coli BL21(DE3) by isothermal titration calorimetry
In DepthDetails ArticlePubMed