BDBM50228150 2-(4-chlorophenylthio)-1-morpholinoethanone::CHEMBL396323
SMILES Clc1ccc(SCC(=O)N2CCOCC2)cc1
InChI Key InChIKey=DCTFZTBAZMXMFI-UHFFFAOYSA-N
Data  1 Kd
  Tab Delimited (TSV)   2D SDfile   Computed 3D by Vconf -m prep SDfile
Find this compound or compounds like it in BindingDB:
Activity Spreadsheet -- Enzyme Inhibition Constant Data from BindingDB
Found 1 hit for monomerid = 50228150
TargetPeptidyl-prolyl cis-trans isomerase FKBP1A(Homo sapiens (Human))
University Of California San Diego
Curated by ChEMBL
LigandPNGBDBM50228150(2-(4-chlorophenylthio)-1-morpholinoethanone | CHEM...)
Affinity DataKd:  1.50E+4nM. Assay description: Binding affinity to human FKBP12 expressed in Escherichia coli BL21(DE3) by isothermal titration calorimetry
In DepthDetails ArticlePubMed