BDBM50228217 CHEMBL174694
SMILES CCOC(=O)OCC1(CCN(CCc2ccccc2)CC1)N(C(=O)CC)c1ccccc1
InChI Key InChIKey=NRJDMTIMIPKSGW-UHFFFAOYSA-N
Data  1 KI
  Tab Delimited (TSV)   2D SDfile   Computed 3D by Vconf -m prep SDfile
Find this compound or compounds like it in BindingDB:
Activity Spreadsheet -- Enzyme Inhibition Constant Data from BindingDB
Found 1 hit for monomerid = 50228217
LigandPNGBDBM50228217(CHEMBL174694)
Affinity DataKi:  10nM. Assay description: In vitro affinity to displace [3H]naloxone from opiate receptor in freshly prepared rat brain homogenates
In DepthDetails ArticlePubMed