BDBM50228425 CHEMBL239118::di-(4-acetamidophenyl) 1-(methylsulfonylamino)-2-(4-guanidinophenyl)-ethanephosphonate
SMILES [#6]-[#6](=O)-[#7]-c1ccc(-[#8]P(=O)([#8]-c2ccc(-[#7]-[#6](-[#6])=O)cc2)[#6](-[#6]-c2ccc(cc2)\[#7]=[#6](\[#7])-[#7])-[#7]S([#6])(=O)=O)cc1
InChI Key InChIKey=BCHBHKJDHVVTJT-UHFFFAOYSA-N
Data  4 IC50
  Tab Delimited (TSV)   2D SDfile   Computed 3D by Vconf -m prep SDfile
Find this compound or compounds like it in BindingDB:
Activity Spreadsheet -- Enzyme Inhibition Constant Data from BindingDB
Found 4 hits for monomerid = 50228425
TargetPlasminogen(Homo sapiens (Human))
University Of Antwerp
Curated by ChEMBL
LigandPNGBDBM50228425(CHEMBL239118 | di-(4-acetamidophenyl) 1-(methylsul...)
Affinity DataIC50:  2.00E+3nM. Assay description: Inhibition of human plasmin
In DepthDetails ArticlePubMed
TargetUrokinase-type plasminogen activator(Homo sapiens (Human))
University Of Antwerp
Curated by ChEMBL
LigandPNGBDBM50228425(CHEMBL239118 | di-(4-acetamidophenyl) 1-(methylsul...)
Affinity DataIC50:  3.5nM. Assay description: Inhibition of human uPA
In DepthDetails ArticlePubMed
TargetTissue-type plasminogen activator(Homo sapiens (Human))
University Of Antwerp
Curated by ChEMBL
LigandPNGBDBM50228425(CHEMBL239118 | di-(4-acetamidophenyl) 1-(methylsul...)
Affinity DataIC50:  3.70E+3nM. Assay description: Inhibition of human recombinant tPA
In DepthDetails ArticlePubMed
TargetProthrombin(Homo sapiens (Human))
University Of Antwerp
Curated by ChEMBL
LigandPNGBDBM50228425(CHEMBL239118 | di-(4-acetamidophenyl) 1-(methylsul...)
Affinity DataIC50:  2.35E+3nM. Assay description: Inhibition of human thrombin
In DepthDetails ArticlePubMed