BDBM50228536 CHEMBL98575
SMILES CS(=O)(=O)Nc1ccc(cc1)N1CCN(CC(O)COc2ccccc2)CC1
InChI Key InChIKey=WXAGJQFTYBUBAZ-UHFFFAOYSA-N
Data  1 IC50
  Tab Delimited (TSV)   2D SDfile   Computed 3D by Vconf -m prep SDfile
Find this compound or compounds like it in BindingDB:
Activity Spreadsheet -- Enzyme Inhibition Constant Data from BindingDB
Found 1 hit for monomerid = 50228536
TargetBeta-1/Beta-2/Beta-3 adrenergic receptor(Homo sapiens (Human))
Berlex Laboratories
Curated by ChEMBL
LigandPNGBDBM50228536(CHEMBL98575)
Affinity DataIC50:  1.58E+4nM. Assay description: Tested for Beta adrenergic receptor binding inhibition from canine ventricular tissue, using [3H]dihydroalprenolol as the radioligand in anesthetized...
In DepthDetails ArticlePubMed