BDBM50228558 CHEMBL95911
SMILES CS(=O)(=O)Nc1ccc(CNCC(O)COc2ccccc2)cc1
InChI Key InChIKey=WFCXENJCPDJVBY-UHFFFAOYSA-N
Data  1 IC50
  Tab Delimited (TSV)   2D SDfile   Computed 3D by Vconf -m prep SDfile
Find this compound or compounds like it in BindingDB:
Activity Spreadsheet -- Enzyme Inhibition Constant Data from BindingDB
Found 1 hit for monomerid = 50228558
TargetBeta-1/Beta-2/Beta-3 adrenergic receptor(Homo sapiens (Human))
Berlex Laboratories
Curated by ChEMBL
LigandPNGBDBM50228558(CHEMBL95911)
Affinity DataIC50:  2.90E+3nM. Assay description: Tested for Beta adrenergic receptor binding inhibition from canine ventricular tissue, using [3H]dihydroalprenolol as the radioligand in anesthetized...
In DepthDetails ArticlePubMed