BDBM50228564 CHEMBL306178
SMILES NC(=O)Cc1cccc(C(=O)c2ccc(Cl)cc2)c1N
InChI Key InChIKey=QYWOBAQCODTFCM-UHFFFAOYSA-N
Data  1 IC50
  Tab Delimited (TSV)   2D SDfile   Computed 3D by Vconf -m prep SDfile
Find this compound or compounds like it in BindingDB:
Activity Spreadsheet -- Enzyme Inhibition Constant Data from BindingDB
Found 1 hit for monomerid = 50228564
TargetProstaglandin G/H synthase 1/2(RAT)
A.H. Robins
Curated by ChEMBL
LigandPNGBDBM50228564(CHEMBL306178)
Affinity DataIC50: >1.00E+6nM. Assay description: Inhibitory activity against Prostaglandin G/H synthase
In DepthDetails ArticlePubMed