BDBM50228656 5,7-dichloro-3-(4-(diethylamino)phenyl)-3-methylquinoline-2,4(1H,3H)-dione::CHEMBL401970
SMILES CCN(CC)c1ccc(cc1)C1(C)C(=O)Nc2cc(Cl)cc(Cl)c2C1=O
InChI Key InChIKey=PSUUEBWZTJTEDC-UHFFFAOYSA-N
Data  1 KI
  Tab Delimited (TSV)   2D SDfile   Computed 3D by Vconf -m prep SDfile
Find this compound or compounds like it in BindingDB:
Activity Spreadsheet -- Enzyme Inhibition Constant Data from BindingDB
Found 1 hit for monomerid = 50228656
Target5-hydroxytryptamine receptor 6(Homo sapiens (Human))
Korea Research Institute Of Chemical Technology
Curated by ChEMBL
LigandPNGBDBM50228656(5,7-dichloro-3-(4-(diethylamino)phenyl)-3-methylqu...)
Affinity DataKi:  9.20nM. Assay description: Displacement of [3H]-LSD from human cloned 5HT6 receptor expressed in HEK293 cells
In DepthDetails ArticlePubMed