BDBM50228833 CHEMBL318836
SMILES COc1ccc(cc1OC1CC2CC1C=C2)C1CNC(=O)N1C
InChI Key InChIKey=JWPLOWRXWAAKTQ-UHFFFAOYSA-N
Data  2 IC50
  Tab Delimited (TSV)   2D SDfile   Computed 3D by Vconf -m prep SDfile
Find this compound or compounds like it in BindingDB:
Activity Spreadsheet -- Enzyme Inhibition Constant Data from BindingDB
Found 2 hits for monomerid = 50228833
TargetcAMP-specific 3',5'-cyclic phosphodiesterase 4C(Rattus norvegicus)
Pfizer
Curated by ChEMBL
LigandPNGBDBM50228833(CHEMBL318836)
Affinity DataIC50:  3.10nM. Assay description: Inhibition of [3H]- rolipram binding to rat cerebral cortex membranes
In DepthDetails ArticlePubMed
TargetcAMP-specific 3',5'-cyclic phosphodiesterase 4C(Rattus norvegicus)
Pfizer
Curated by ChEMBL
LigandPNGBDBM50228833(CHEMBL318836)
Affinity DataIC50:  130nM. Assay description: Inhibition of calcium-independent Phosphodiesterase 4
In DepthDetails ArticlePubMed