BDBM50228849 CHEMBL171394
SMILES Fc1cccc(Oc2ncccc2C(=O)NCc2ccccc2)c1
InChI Key InChIKey=KQUXIWCKLIRVAU-UHFFFAOYSA-N
Data  2 IC50
  Tab Delimited (TSV)   2D SDfile   Computed 3D by Vconf -m prep SDfile
Find this compound or compounds like it in BindingDB:
Activity Spreadsheet -- Enzyme Inhibition Constant Data from BindingDB
Found 2 hits for monomerid = 50228849
TargetcAMP-specific 3',5'-cyclic phosphodiesterase 4C(Rattus norvegicus)
Pfizer
Curated by ChEMBL
LigandPNGBDBM50228849(CHEMBL171394)
Affinity DataIC50:  1.80E+3nM. Assay description: Inhibition of [3H]cAMP (NEN NET-275) binding to Calcium-Independent Phosphodiesterase from rat brain.
In DepthDetails ArticlePubMed
TargetcAMP-specific 3',5'-cyclic phosphodiesterase 4C(Rattus norvegicus)
Pfizer
Curated by ChEMBL
LigandPNGBDBM50228849(CHEMBL171394)
Affinity DataIC50:  2.90E+4nM. Assay description: Inhibition of [3H]rolipram binding to rat brain membranes.
In DepthDetails ArticlePubMed