BDBM50228955 CHEMBL109436
SMILES OC(=O)C1Cc2c(CN1C(=O)Cc1ccccc1)ncn2Cc1ccccc1
InChI Key InChIKey=JSRPPNHORAJQLL-UHFFFAOYSA-N
Data  2 IC50
  Tab Delimited (TSV)   2D SDfile   Computed 3D by Vconf -m prep SDfile
Find this compound or compounds like it in BindingDB:
Activity Spreadsheet -- Enzyme Inhibition Constant Data from BindingDB
Found 2 hits for monomerid = 50228955
LigandPNGBDBM50228955(CHEMBL109436)
Affinity DataIC50:  1.40E+3nM. Assay description: Binding affinity against Angiotensin II receptor, from rat adrenal gland
In DepthDetails ArticlePubMed
LigandPNGBDBM50228955(CHEMBL109436)
Affinity DataIC50:  1.40E+3nM. Assay description: Binding affinity against Angiotensin II receptor, from rat adrenal gland
In DepthDetails ArticlePubMed