BDBM50228999 CHEMBL110532
SMILES COc1ccc(Cn2cnc3CN([C@@H](Cc23)C(O)=O)C(=O)C(C)c2ccccc2)cc1C
InChI Key InChIKey=FBFULINYKCLAMW-UGNFMNBCSA-N
Data  1 IC50
  Tab Delimited (TSV)   2D SDfile   Computed 3D by Vconf -m prep SDfile
Find this compound or compounds like it in BindingDB:
Activity Spreadsheet -- Enzyme Inhibition Constant Data from BindingDB
Found 1 hit for monomerid = 50228999
LigandPNGBDBM50228999(CHEMBL110532)
Affinity DataIC50:  560nM. Assay description: Binding affinity against Angiotensin II receptor, from rat adrenal gland
In DepthDetails ArticlePubMed