BDBM50229072 CHEMBL162841
SMILES [H][C@]12CCCN([C@@]1([H])C[C@]1([H])N(CCc3ccccc13)C2)S(C)(=O)=O
InChI Key InChIKey=VMXHRWVVRCYCLY-PVAVHDDUSA-N
Data  2 KI
  Tab Delimited (TSV)   2D SDfile   Computed 3D by Vconf -m prep SDfile
Find this compound or compounds like it in BindingDB:
Activity Spreadsheet -- Enzyme Inhibition Constant Data from BindingDB
Found 2 hits for monomerid = 50229072
LigandPNGBDBM50229072(CHEMBL162841)
Affinity DataKi:  1.70nM. Assay description: Binding affinity to alpha-2 adrenergic receptor determined by measurement of [3H]yohimbine displacement from rat cortical membrane
In DepthDetails ArticlePubMed
TargetAlpha-1A/Alpha-1B/Alpha-1D adrenergic receptor(Rattus norvegicus (rat))
Syntex Research
Curated by ChEMBL
LigandPNGBDBM50229072(CHEMBL162841)
Affinity DataKi:  5.50E+3nM. Assay description: Binding affinity to alpha-1 adrenergic receptor determined by measurement of [3H]prazosin displacement from rat cortical membrane
In DepthDetails ArticlePubMed