BDBM50229335 CYCLODEXTRIN SULFATE (CDS)::Cyclodextrin Sulfate
SMILES [K+].[K+].[K+].[K+].[K+].[K+].[K+].[K+].[K+].[K+].[K+].[K+].[K+].[K+].[H][C@]12OC(COS([O-])(=O)=O)[C@@]([H])(O[C@@]3([H])OC(COS([O-])(=O)=O)[C@@]([H])(O[C@@]4([H])OC(COS([O-])(=O)=O)[C@@]([H])(O[C@@]5([H])OC(COS([O-])(=O)=O)[C@@]([H])(O[C@@]6([H])OC(COS([O-])(=O)=O)[C@@]([H])(O[C@@]7([H])OC(COS([O-])(=O)=O)[C@@]([H])(O[C@@]8([H])OC(COS([O-])(=O)=O)[C@@]([H])(O1)C(O)C8OS([O-])(=O)=O)C(O)C7OS([O-])(=O)=O)C(O)C6OS([O-])(=O)=O)C(O)C5OS([O-])(=O)=O)C(O)C4OS([O-])(=O)=O)C(O)C3OS([O-])(=O)=O)C(O)C2OS([O-])(=O)=O
InChI Key InChIKey=MQGDTEYLKHUGPA-JJVVBRQISA-A
Data  1 IC50
  Tab Delimited (TSV)   2D SDfile   Computed 3D by Vconf -m prep SDfile
Find this compound or compounds like it in BindingDB:
Activity Spreadsheet -- Enzyme Inhibition Constant Data from BindingDB
Found 1 hit for monomerid = 50229335
TargetNitric oxide synthase, inducible(Mus musculus (mouse))
Universit£ di Firenze
Curated by ChEMBL
LigandPNGBDBM50229335(CHEMBL5284763)
Affinity DataIC50:  5.22E+3nM. Assay description: In vitro inhibitory activity against Angiotensin I converting enzyme in rabbit lung, using hippuryl-histidyl-leucine as substrate