BDBM50229467 CHEMBL83505
SMILES CCCCc1nc(Cl)c(COC)n1Cc1ccc(cc1)-c1ccccc1C(=O)NNS(=O)(=O)C(F)(F)F
InChI Key InChIKey=DTMSECKOZVHJRF-UHFFFAOYSA-N
Data  1 IC50
  Tab Delimited (TSV)   2D SDfile   Computed 3D by Vconf -m prep SDfile
Find this compound or compounds like it in BindingDB:
Activity Spreadsheet -- Enzyme Inhibition Constant Data from BindingDB
Found 1 hit for monomerid = 50229467
LigandPNGBDBM50229467(CHEMBL83505)
Affinity DataIC50:  200nM. Assay description: Inhibition of radioligand [3H]angiotensin II binding to angiotensin II receptor of rat adrenal cortical membrane
In DepthDetails ArticlePubMed