BDBM50229478 CHEMBL419120
SMILES CCCCc1nc(Cl)c(CO)n1Cc1ccc(cc1)-c1cccc(C)c1C(O)=O
InChI Key InChIKey=KSCJBKAVQXKTFU-UHFFFAOYSA-N
Data  1 IC50
  Tab Delimited (TSV)   2D SDfile   Computed 3D by Vconf -m prep SDfile
Find this compound or compounds like it in BindingDB:
Activity Spreadsheet -- Enzyme Inhibition Constant Data from BindingDB
Found 1 hit for monomerid = 50229478
LigandPNGBDBM50229478(CHEMBL419120)
Affinity DataIC50:  1.90E+3nM. Assay description: Inhibition of radioligand [3H]angiotensin II binding to angiotensin II receptor of rat adrenal cortical membrane
In DepthDetails ArticlePubMed