BDBM50229484 CHEMBL84585
SMILES CCCCc1nc(Cl)c(C=O)n1Cc1ccc(cc1)-c1cccc(c1)-c1nn[nH]n1
InChI Key InChIKey=MYCJRGBIWPIQAR-UHFFFAOYSA-N
Data  1 IC50
  Tab Delimited (TSV)   2D SDfile   Computed 3D by Vconf -m prep SDfile
Find this compound or compounds like it in BindingDB:
Activity Spreadsheet -- Enzyme Inhibition Constant Data from BindingDB
Found 1 hit for monomerid = 50229484
LigandPNGBDBM50229484(CHEMBL84585)
Affinity DataIC50: >1.00E+3nM. Assay description: Inhibition of radioligand [3H]angiotensin II binding to angiotensin II receptor of rat adrenal cortical membrane
In DepthDetails ArticlePubMed