BDBM50229501 CHEMBL87162
SMILES COc1cc(\C=C/c2ccccc2)cc(OC)c1OC
InChI Key InChIKey=CMQGCWMEXQRWSS-KTKRTIGZSA-N
Data  1 IC50
  Tab Delimited (TSV)   2D SDfile   Computed 3D by Vconf -m prep SDfile
Find this compound or compounds like it in BindingDB:
Activity Spreadsheet -- Enzyme Inhibition Constant Data from BindingDB
Found 1 hit for monomerid = 50229501
TargetSimilar to alpha-tubulin isoform 1(Bos taurus)
Purdue University
Curated by ChEMBL
LigandPNGBDBM50229501(CHEMBL87162)
Affinity DataIC50:  3.60E+4nM. Assay description: Ability to inhibit Tubulin polymerization in Bovine brain
In DepthDetails ArticlePubMed