BDBM50229577 CHEMBL63818
SMILES [H][C@@]1(CO)CC[C@]2([H])C(C1)c1c(O)cc(cc1OC2(C)C)C(C)(C)CCCCCC
InChI Key InChIKey=MVEVPDCVOXJVBD-WWJDGXJASA-N
Data  1 KI
  Tab Delimited (TSV)   2D SDfile   Computed 3D by Vconf -m prep SDfile
Find this compound or compounds like it in BindingDB:
Activity Spreadsheet -- Enzyme Inhibition Constant Data from BindingDB
Found 1 hit for monomerid = 50229577
TargetCannabinoid receptor 1/2(Rattus norvegicus (Rat))
Hebrew University
Curated by ChEMBL
LigandPNGBDBM50229577(CHEMBL63818)
Affinity DataKi:  0.0450nM. Assay description: Compound was evaluated for the competitive inhibition of [3H]3-(1,1-Dimethyl-heptyl)-9-hydroxymethyl-6,6-dimethyl-6a,7,8,9,10,10a-hexahydro-6H-benzo[...
In DepthDetails ArticlePubMed