BDBM50229903 CHEMBL313206
SMILES Cc1cc(N)c2cc(NC(=O)CCCCC(=O)Nc3ccc4nc(C)cc(N)c4c3)ccc2n1
InChI Key InChIKey=OYOBXWLKVCUSDI-UHFFFAOYSA-N
Data  1 IC50
  Tab Delimited (TSV)   2D SDfile   Computed 3D by Vconf -m prep SDfile
Find this compound or compounds like it in BindingDB:
Activity Spreadsheet -- Enzyme Inhibition Constant Data from BindingDB
Found 1 hit for monomerid = 50229903
TargetC5a anaphylatoxin chemotactic receptor 1(Homo sapiens (Human))
Merck Sharp And Dohme Research Laboratories
Curated by ChEMBL
LigandPNGBDBM50229903(CHEMBL313206)
Affinity DataIC50: >1.09E+5nM. Assay description: Ability to inhibit binding of radiolabeled C5a anaphylatoxin to intact membrane bound receptor from human neutrophils.
In DepthDetails ArticlePubMed