BDBM50229907 CHEMBL88036
SMILES Cc1cc(NCc2ccccc2)c2cc(NC(=O)\C=C\c3ccccc3C(F)(F)F)ccc2n1
InChI Key InChIKey=UZBKAOAWCVUGKY-SDNWHVSQSA-N
Data  1 IC50
  Tab Delimited (TSV)   2D SDfile   Computed 3D by Vconf -m prep SDfile
Find this compound or compounds like it in BindingDB:
Activity Spreadsheet -- Enzyme Inhibition Constant Data from BindingDB
Found 1 hit for monomerid = 50229907
TargetC5a anaphylatoxin chemotactic receptor 1(Homo sapiens (Human))
Merck Sharp And Dohme Research Laboratories
Curated by ChEMBL
LigandPNGBDBM50229907(CHEMBL88036)
Affinity DataIC50: >2.16E+5nM. Assay description: Ability to inhibit binding of radiolabeled C5a anaphylatoxin to intact membrane bound receptor from human neutrophils.
In DepthDetails ArticlePubMed