BDBM50229960 CHEMBL357705
SMILES [H][C@@]12CCC(=C)CC1(CCN(CC=C)C2)c1cccc(O)c1
InChI Key InChIKey=XCYUHNLNTCJWLZ-KKFHFHRHSA-N
Data  1 IC50
  Tab Delimited (TSV)   2D SDfile   Computed 3D by Vconf -m prep SDfile
Find this compound or compounds like it in BindingDB:
Activity Spreadsheet -- Enzyme Inhibition Constant Data from BindingDB
Found 1 hit for monomerid = 50229960
TargetDelta-type/Kappa-type/Mu-type opioid receptor(Homo sapiens (Human))
Glaxo Group Research
Curated by ChEMBL
LigandPNGBDBM50229960(CHEMBL357705)
Affinity DataIC50:  140nM. Assay description: In vitro inhibitory activity against opioid receptor in Guinea pig ileum
In DepthDetails ArticlePubMed