BDBM50230047 CHEMBL127877
SMILES OC(=O)CCSC(SCCC(O)=O)c1cccc(\C=C\c2ccc3ccc(Cl)cc3n2)c1
InChI Key InChIKey=YVRKZBMFZRCTDJ-XBXARRHUSA-N
Data  1 IC50
  Tab Delimited (TSV)   2D SDfile   Computed 3D by Vconf -m prep SDfile
Find this compound or compounds like it in BindingDB:
Activity Spreadsheet -- Enzyme Inhibition Constant Data from BindingDB
Found 1 hit for monomerid = 50230047
TargetCysteinyl leukotriene receptor 1/2(Homo sapiens (Human))
Merck Frosst Centre For Therapeutic Research
Curated by ChEMBL
LigandPNGBDBM50230047(CHEMBL127877)
Affinity DataIC50:  3nM. Assay description: Inhibition of human carbonic anhydrase II
In DepthDetails ArticlePubMed