BDBM50230100 4-fluoro-N-(5-(4-fluorobenzylthio)-1,3,4-thiadiazol-2-yl)benzamide::CHEMBL255738::N-(5-(4-fluorobenzylthio)-1,3,4-thiadiazol-2-yl)-4-fluorobenzamide
SMILES Fc1ccc(CSc2nnc(NC(=O)c3ccc(F)cc3)s2)cc1
InChI Key InChIKey=ZDYQINDXPNAOKX-UHFFFAOYSA-N
Data  7 KI
  Tab Delimited (TSV)   2D SDfile   Computed 3D by Vconf -m prep SDfile
Find this compound or compounds like it in BindingDB:
Activity Spreadsheet -- Enzyme Inhibition Constant Data from BindingDB
Found 7 hits for monomerid = 50230100
TargetTyrosine-protein kinase ABL1(Homo sapiens (Human))
Universit&Aagrov
Curated by PDSP Ki Database
LigandPNGBDBM50230100(4-fluoro-N-(5-(4-fluorobenzylthio)-1,3,4-thiadiazo...)
Affinity DataKi:  44nM
In DepthDetails ArticlePubMed
TargetTyrosine-protein kinase ABL1(Homo sapiens (Human))
Universit&Aagrov
Curated by PDSP Ki Database
LigandPNGBDBM50230100(4-fluoro-N-(5-(4-fluorobenzylthio)-1,3,4-thiadiazo...)
Affinity DataKi:  100nM. Assay description: Inhibition of histidine-tagged human recombinant ABL expressed in baculovirus system assessed as [gamma32P]ATP utilization after 10 mins by liquid sc...
In DepthDetails ArticlePubMed
TargetTyrosine-protein kinase ABL1(Homo sapiens (Human))
Universit&Aagrov
Curated by PDSP Ki Database
LigandPNGBDBM50230100(4-fluoro-N-(5-(4-fluorobenzylthio)-1,3,4-thiadiazo...)
Affinity DataKi:  120nM. Assay description: Inhibition of histidine-tagged human recombinant ABL expressed in baculovirus system assessed as [gamma32P]ATP utilization after 10 mins by liquid sc...
In DepthDetails ArticlePubMed
TargetProto-oncogene tyrosine-protein kinase Src(Homo sapiens (Human))
Universit&Aagrov
Curated by PDSP Ki Database
LigandPNGBDBM50230100(4-fluoro-N-(5-(4-fluorobenzylthio)-1,3,4-thiadiazo...)
Affinity DataKi:  354nM
In DepthDetails ArticlePubMed
TargetTyrosine-protein kinase ABL1(Homo sapiens (Human))
Universit&Aagrov
Curated by PDSP Ki Database
LigandPNGBDBM50230100(4-fluoro-N-(5-(4-fluorobenzylthio)-1,3,4-thiadiazo...)
Affinity DataKi:  470nM. Assay description: Mixed-type inhibition of histidine-tagged human recombinant ABL expressed in baculovirus system assessed as [gamma32P]ATP utilization after 10 mins b...
In DepthDetails ArticlePubMed
TargetProto-oncogene tyrosine-protein kinase Src(Homo sapiens (Human))
Universit&Aagrov
Curated by PDSP Ki Database
LigandPNGBDBM50230100(4-fluoro-N-(5-(4-fluorobenzylthio)-1,3,4-thiadiazo...)
Affinity DataKi:  550nM. Assay description: Inhibition of histidine-tagged human recombinant SRC expressed in baculovirus system assessed as [gamma32P]ATP utilization after 10 mins by liquid sc...
In DepthDetails ArticlePubMed
TargetProto-oncogene tyrosine-protein kinase Src(Homo sapiens (Human))
Universit&Aagrov
Curated by PDSP Ki Database
LigandPNGBDBM50230100(4-fluoro-N-(5-(4-fluorobenzylthio)-1,3,4-thiadiazo...)
Affinity DataKi:  550nM. Assay description: Inhibition of histidine-tagged human recombinant SRC expressed in baculovirus system assessed as [gamma32P]ATP utilization after 10 mins by liquid sc...
In DepthDetails ArticlePubMed