BDBM50230105 CHEMBL339446
SMILES CCCCc1ncc(\C=C(/Cc2cccnc2)C(O)=O)n1Cc1ccccc1Cl
InChI Key InChIKey=JDBIJSAJVDISJU-CPNJWEJPSA-N
Data  1 IC50
  Tab Delimited (TSV)   2D SDfile   Computed 3D by Vconf -m prep SDfile
Find this compound or compounds like it in BindingDB:
Activity Spreadsheet -- Enzyme Inhibition Constant Data from BindingDB
Found 1 hit for monomerid = 50230105
LigandPNGBDBM50230105(CHEMBL339446)
Affinity DataIC50:  300nM. Assay description: Inhibition of [125I]angiotensin II specific binding to rat mesenteric arteries
In DepthDetails ArticlePubMed