BDBM50230106 CHEMBL125341
SMILES CCCCC(\C(=C/c1cnc(CCCC)n1Cc1ccccc1Cl)C(O)=O)c1cccs1
InChI Key InChIKey=MKGXUMJWMPUDTO-CJLVFECKSA-N
Data  1 IC50
  Tab Delimited (TSV)   2D SDfile   Computed 3D by Vconf -m prep SDfile
Find this compound or compounds like it in BindingDB:
Activity Spreadsheet -- Enzyme Inhibition Constant Data from BindingDB
Found 1 hit for monomerid = 50230106
LigandPNGBDBM50230106(CHEMBL125341)
Affinity DataIC50:  1.87E+4nM. Assay description: Inhibition of [125I]angiotensin II specific binding to rat mesenteric arteries
In DepthDetails ArticlePubMed