BDBM50230112 CHEMBL338690
SMILES CCCCc1ncc(\C(Cc2ccccc2)=C\C(O)=O)n1Cc1ccccc1Cl
InChI Key InChIKey=NYFJCSOZPSTSDE-HMMYKYKNSA-N
Data  1 IC50
  Tab Delimited (TSV)   2D SDfile   Computed 3D by Vconf -m prep SDfile
Find this compound or compounds like it in BindingDB:
Activity Spreadsheet -- Enzyme Inhibition Constant Data from BindingDB
Found 1 hit for monomerid = 50230112
LigandPNGBDBM50230112(CHEMBL338690)
Affinity DataIC50:  9.80E+3nM. Assay description: Inhibition of human carbonic anhydrase II
In DepthDetails ArticlePubMed