BDBM50230219 CHEMBL545088
SMILES Cl.Cc1cn(cn1)-c1cccc(OS(N)(=O)=O)c1
InChI Key InChIKey=TYJYBJXRNSDLLS-UHFFFAOYSA-N
Data  1 IC50
  Tab Delimited (TSV)   2D SDfile   Computed 3D by Vconf -m prep SDfile
Find this compound or compounds like it in BindingDB:
Activity Spreadsheet -- Enzyme Inhibition Constant Data from BindingDB
Found 1 hit for monomerid = 50230219
TargetCarbonic anhydrase 6(Bos taurus)
A.H. Robins
Curated by ChEMBL
LigandPNGBDBM50230219(CHEMBL545088)
Affinity DataIC50:  94nM. Assay description: Bovine erythrocyte carbonic anhydrase inhibitory activity of the compound.
In DepthDetails ArticlePubMed