BDBM50230223 CHEMBL144453
SMILES Oc1ccc2c(nccc2n1)-c1ccc(F)cc1
InChI Key InChIKey=CVXFNDOAPZULEK-UHFFFAOYSA-N
Data  1 IC50
  Tab Delimited (TSV)   2D SDfile   Computed 3D by Vconf -m prep SDfile
Find this compound or compounds like it in BindingDB:
Activity Spreadsheet -- Enzyme Inhibition Constant Data from BindingDB
Found 1 hit for monomerid = 50230223
TargetcGMP-inhibited 3',5'-cyclic phosphodiesterase 3A/3B(Homo sapiens (Human))
Sterling Winthrop Pharmaceuticals Research Division
Curated by ChEMBL
LigandPNGBDBM50230223(CHEMBL144453)
Affinity DataIC50:  940nM. Assay description: In vitro inhibitory activity against cAMP PDE III.
In DepthDetails ArticlePubMed