BDBM50230232 CHEMBL145429
SMILES CC(=O)c1nccc2nc(O)ccc12
InChI Key InChIKey=UDSPOMXIMBWZJW-UHFFFAOYSA-N
Data  1 IC50
  Tab Delimited (TSV)   2D SDfile   Computed 3D by Vconf -m prep SDfile
Find this compound or compounds like it in BindingDB:
Activity Spreadsheet -- Enzyme Inhibition Constant Data from BindingDB
Found 1 hit for monomerid = 50230232
TargetcGMP-inhibited 3',5'-cyclic phosphodiesterase 3A/3B(Homo sapiens (Human))
Sterling Winthrop Pharmaceuticals Research Division
Curated by ChEMBL
LigandPNGBDBM50230232(CHEMBL145429)
Affinity DataIC50:  1.42E+3nM. Assay description: In vitro inhibitory activity against cAMP PDE III.
In DepthDetails ArticlePubMed