BDBM50230279 CHEMBL144706
SMILES Cc1nccc2nc(S)ccc12
InChI Key InChIKey=JCPSOAPENKREHO-UHFFFAOYSA-N
Data  1 IC50
  Tab Delimited (TSV)   2D SDfile   Computed 3D by Vconf -m prep SDfile
Find this compound or compounds like it in BindingDB:
Activity Spreadsheet -- Enzyme Inhibition Constant Data from BindingDB
Found 1 hit for monomerid = 50230279
TargetcGMP-inhibited 3',5'-cyclic phosphodiesterase 3A/3B(Homo sapiens (Human))
Sterling Winthrop Pharmaceuticals Research Division
Curated by ChEMBL
LigandPNGBDBM50230279(CHEMBL144706)
Affinity DataIC50:  960nM. Assay description: Inhibition of cAMP Phosphodiesterase 3
In DepthDetails ArticlePubMed