BDBM50230550 CHEMBL174020
SMILES [H][C@@]12CCC[C@@]([H])(C1)c1cc(Cl)cc(C(=O)N[C@]3([H])CN4CCC3CC4)c1O2
InChI Key InChIKey=ZIAMDRHEQRSMSY-JCKWVBRZSA-N
Data  1 KI
  Tab Delimited (TSV)   2D SDfile   Computed 3D by Vconf -m prep SDfile
Find this compound or compounds like it in BindingDB:
Activity Spreadsheet -- Enzyme Inhibition Constant Data from BindingDB
Found 2 hits for monomerid = 50230550
TargetMatrix metalloproteinase-9(Homo sapiens (Human))
TBA
Curated by ChEMBL
LigandPNGBDBM50230550(CHEMBL5268799)
Affinity DataIC50:  0.430nM. Assay description: Binding affinity against Dihydrofolate reductase of rat liver
Target72 kDa type IV collagenase(Homo sapiens (Human))
TBA
Curated by ChEMBL
LigandPNGBDBM50230550(CHEMBL5268799)
Affinity DataIC50:  0.670nM. Assay description: Antagonistic activity against beta-1 adrenergic receptor of isolated guinea pig atria