BDBM50230949 CHEMBL4096121
SMILES COc1ccc2NC(=O)\C(=N/CCc3ccc(cc3)S(N)(=O)=O)c2c1
InChI Key InChIKey=DRNCSPJAWMPTLB-UHFFFAOYSA-N
Data  4 KI
  Tab Delimited (TSV)   2D SDfile   Computed 3D by Vconf -m prep SDfile
Find this compound or compounds like it in BindingDB:
Activity Spreadsheet -- Enzyme Inhibition Constant Data from BindingDB
Found 4 hits for monomerid = 50230949
TargetCarbonic anhydrase 2(Homo sapiens (Human))
Kafrelsheikh University
Curated by ChEMBL
LigandPNGBDBM50230949(CHEMBL4096121)
Affinity DataKi:  34nM. Assay description: Inhibition of human recombinant carbonic anhydrase 2 incubated for 15 mins prior to testing by stopped-flow CO2 hydration assay
In DepthDetails ArticlePubMed
TargetCarbonic anhydrase 4(Homo sapiens (Human))
Kafrelsheikh University
Curated by ChEMBL
LigandPNGBDBM50230949(CHEMBL4096121)
Affinity DataKi:  43nM. Assay description: Inhibition of human recombinant carbonic anhydrase 4 incubated for 15 mins prior to testing by stopped-flow CO2 hydration assay
In DepthDetails ArticlePubMed
TargetCarbonic anhydrase 7(Homo sapiens (Human))
Kafrelsheikh University
Curated by ChEMBL
LigandPNGBDBM50230949(CHEMBL4096121)
Affinity DataKi:  89nM. Assay description: Inhibition of human recombinant carbonic anhydrase 7 incubated for 15 mins prior to testing by stopped-flow CO2 hydration assay
In DepthDetails ArticlePubMed
TargetCarbonic anhydrase 1(Homo sapiens (Human))
Kafrelsheikh University
Curated by ChEMBL
LigandPNGBDBM50230949(CHEMBL4096121)
Affinity DataKi:  206nM. Assay description: Inhibition of human recombinant carbonic anhydrase 1 incubated for 15 mins prior to testing by stopped-flow CO2 hydration assay
In DepthDetails ArticlePubMed