BDBM50231006 CHEMBL307946
SMILES Cc1nc2ccccc2nc1Oc1ccc(cc1)-c1ccccc1-c1nn[nH]n1
InChI Key InChIKey=KYHBZVXJYWGAPU-UHFFFAOYSA-N
Data  3 KI
  Tab Delimited (TSV)   2D SDfile   Computed 3D by Vconf -m prep SDfile
Find this compound or compounds like it in BindingDB:
Activity Spreadsheet -- Enzyme Inhibition Constant Data from BindingDB
Found 3 hits for monomerid = 50231006
TargetType-1 angiotensin II receptor A/B(RAT)
Bristol-Myers Squibb Pharmaceutical Research Institute
Curated by ChEMBL
LigandPNGBDBM50231006(CHEMBL307946)
Affinity DataKi:  3.45E+3nM. Assay description: Binding affinity of compound in presence of bovine serum albumin (BSA) at 0.01% against rat Angiotensin II receptor, type 1
In DepthDetails ArticlePubMed
TargetType-1 angiotensin II receptor A/B(RAT)
Bristol-Myers Squibb Pharmaceutical Research Institute
Curated by ChEMBL
LigandPNGBDBM50231006(CHEMBL307946)
Affinity DataKi:  3.45E+3nM. Assay description: Binding affinity for Angiotensin II receptor, type 1 in rat adrenal cortical membranes using [125I]Sar1, Ile8-angiotensin II
In DepthDetails ArticlePubMed
TargetType-1 angiotensin II receptor A/B(RAT)
Bristol-Myers Squibb Pharmaceutical Research Institute
Curated by ChEMBL
LigandPNGBDBM50231006(CHEMBL307946)
Affinity DataKi:  4.00E+4nM. Assay description: Binding affinity of compound in presence of bovine serum albumin (BSA) at 0.22% against rat Angiotensin II receptor, type 1
In DepthDetails ArticlePubMed