BDBM50231035 CHEMBL401950::sodium; (3R,5R)-7-[3-(3-carbamoylmethyl-phenylsulfamoyl)-4,5-bis-(4-fluoro-phenyl)-2-isopropyl-pyrrol-1-yl]-3,5-dihydroxy-heptanoate
SMILES CC(C)c1c(c(c(-c2ccc(F)cc2)n1CC[C@@H](O)C[C@@H](O)CC([O-])=O)-c1ccc(F)cc1)S(=O)(=O)Nc1cccc(CC(N)=O)c1
InChI Key InChIKey=ZXGVFUKWWWNTTQ-VSGBNLITSA-M
Data  1 IC50
  Tab Delimited (TSV)   2D SDfile   Computed 3D by Vconf -m prep SDfile
Find this compound or compounds like it in BindingDB:
Activity Spreadsheet -- Enzyme Inhibition Constant Data from BindingDB
Found 1 hit for monomerid = 50231035
Target3-hydroxy-3-methylglutaryl-coenzyme A reductase(Rattus norvegicus (rat))
Pfizer
Curated by ChEMBL
LigandPNGBDBM50231035(CHEMBL401950 | sodium; (3R,5R)-7-[3-(3-carbamoylme...)
Affinity DataIC50:  1nM. Assay description: Inhibition of rat microsomal HMGCoA reductase
In DepthDetails ArticlePubMed