BDBM50231110 CHEMBL400779::N-(1-(7-hydroxynaphthalen-1-yl)propan-2-yl)-4-(trifluoromethoxy)benzamide
SMILES CC(Cc1cccc2ccc(O)cc12)NC(=O)c1ccc(OC(F)(F)F)cc1
InChI Key InChIKey=PZFVQPWCIVVTNP-UHFFFAOYSA-N
Data  1 IC50
  Tab Delimited (TSV)   2D SDfile   Computed 3D by Vconf -m prep SDfile
Find this compound or compounds like it in BindingDB:
Activity Spreadsheet -- Enzyme Inhibition Constant Data from BindingDB
Found 1 hit for monomerid = 50231110
LigandPNGBDBM50231110(CHEMBL400779 | N-(1-(7-hydroxynaphthalen-1-yl)prop...)
Affinity DataIC50:  81nM. Assay description: Antagonist activity at human TRPV1 assessed as inhibition of capsaicin-induced calcium influx in HEK293 cells
In DepthDetails ArticlePubMed