BDBM50231232 1-(2-phenylpropyl)-4-oxopiperidine O-(2,6-Dichlorobenzyl)oxime::1-(3-phenylpropyl)piperidin-4-one O-2,6-dichlorobenzyl oxime::CHEMBL399528
SMILES Clc1cccc(Cl)c1-[#6]-[#8]\[#7]=[#6]-1\[#6]-[#6]-[#7](-[#6]-[#6]-[#6]-c2ccccc2)-[#6]-[#6]-1
InChI Key InChIKey=ZZLQXIOXUISDRP-UHFFFAOYSA-N
Data  2 IC50
  Tab Delimited (TSV)   2D SDfile   Computed 3D by Vconf -m prep SDfile
Find this compound or compounds like it in BindingDB:
Activity Spreadsheet -- Enzyme Inhibition Constant Data from BindingDB
Found 2 hits for monomerid = 50231232
TargetCholinesterase(Equus caballus (Horse))
Ege University
Curated by ChEMBL
LigandPNGBDBM50231232(1-(2-phenylpropyl)-4-oxopiperidine O-(2,6-Dichloro...)
Affinity DataIC50: >1.00E+5nM. Assay description: Inhibition of horse serum BuChE by modified Ellman's method
In DepthDetails ArticlePubMed
TargetAcetylcholinesterase(Electrophorus electricus (Electric eel))
Ege University
Curated by ChEMBL
LigandPNGBDBM50231232(1-(2-phenylpropyl)-4-oxopiperidine O-(2,6-Dichloro...)
Affinity DataIC50:  1.21E+4nM. Assay description: Inhibition of electric eel AChE by modified Ellman's method
In DepthDetails ArticlePubMed