BDBM50231280 1-(3-cyano-4-fluorophenyl)-6-[4-(3-dimethylaminomethyl-1H-pyrazol-4-yl)-2-fluorophenyl]-7-fluoro-1H-indazole-3-carboxylicacid amide::CHEMBL399163
SMILES CN(C)Cc1[nH]ncc1-c1ccc(c(F)c1)-c1ccc2c(nn(-c3ccc4onc(N)c4c3)c2c1F)C(N)=O
InChI Key InChIKey=WSQATAJBAWYABP-UHFFFAOYSA-N
Data  1 KI
  Tab Delimited (TSV)   2D SDfile   Computed 3D by Vconf -m prep SDfile
Find this compound or compounds like it in BindingDB:
Activity Spreadsheet -- Enzyme Inhibition Constant Data from BindingDB
Found 1 hit for monomerid = 50231280
TargetCoagulation factor X(Homo sapiens (Human))
Johnson & Johnson Pharmaceutical Research And Development
Curated by ChEMBL
LigandPNGBDBM50231280(1-(3-cyano-4-fluorophenyl)-6-[4-(3-dimethylaminome...)
Affinity DataKi:  1.40nM. Assay description: Inhibition of human factor 10a
In DepthDetails ArticlePubMed